Como corrigir erros no Android Studio?

Fala dev, professor Emerson aqui. É muito comum ler comentários de meus alunos no meu canal sobre erros enfrentados durante a Instalação ou durante o uso do Android Studio.

Nesse artigo irei deixar aqui algumas possíveis soluções para os erros mais comuns que você possa estar tendo.

Erro ao logar/criar conta no Google pelo Android [ATUALIZADO ...

Emulator: PANIC: Cannot find AVD system path. Please define ANDROID_SDK_ROOT

Esse erro é muito associado ao caminho da instalação do SDK. O Android Studio não permite que você utilize espaços ou caracteres especias no diretório onde você está instalando seus recursos.

Exemplos de um caminhos de instalação inválido:

c:\user\emerson machado\android\sdk

Acima o caminho de instalação possui um “espaço” e por isso se torna inválido, outro exemplo de caminho de instalação inválido:

c:\user\émerson\android\sdk

No exemplo acima o caminho de instalação possui uma palavra com caractere especial e por isso se torna inválido.

Como corrigir esse erro?

Abra o seu Android Studio na tela inicial e vá até a opção configure:

Depois clique em SDK Manager:

Na próxima janela que vai abrir, vá até a opção Android Sdk no lado esquerdo:

E na parte superior em Android SDK Location verifique se está tudo correto de acordo com o que foi explicado:

Caso o caminho do SDK não esteja de acor você pode editar o caminho clicando em Edit e escolhendo um local de instalação adequado.

The application could not be installed: INSTALL_FAILED_USER_RESTRICTED

Esse erro geralmente está associado ao privilégio de usuário do sistema.

Para corrigir esse problema verifique se seu usuário é possui privilégios de Administrador ou então execute o Android Studio como Administrador, para fazer isso é bem simples:

Primeiro clique com o botão direito sob o ícone do Android Studio:

Procure pela opção “Executar como administrador” e clique nele:

Pronto, seu Android Studio agora possui acesso administrador, vale ressaltar que o erro pode ser agravado por outros fatores já mencionados aqui nesse artigo, por isso recomendo que você verifique todas as dicas.

Unable to install Intel® HAXM

Esse erro está diretamente ligado ao seu processador. Alguns modelos mais atuais da linha Intel possuem uma tecnologia de virtualização que auxilia no desempenho na hora de utilizar máquinas virtuais.

O emulador do Android Studio (AVD) é uma máquina virtual, e se você recebeu essa mensagem é porque (provavelmente) você possui essa tecnologia no seu computador porém ela está desativada.

Para ativar a virtualização você precisa desligar seu computador e ao liga-lo novamente, na primeira tela (preta) você deverá pressionar a tecla del (ou delete) do seu teclado para acessar a sua bios. Obs: O modo de acessar a bios varia de modelos de computadores recomendo que pesquise no Google – Como acessar a bios do computar “modelo ou série do seu pc”.

Se tudo correr bem você verá uma tela semelhante a essa:

Saiba como configurar a BIOS do PC para economizar energia | Dicas ...

Caso seu PC seja mais moderno essa tela poderá ser mais interativa tendo até cursor do mause para facilitar a navegação:

Criandobits

Uma vez dentro da bios tome bastante cuidado, pois uma configuração indevida poderá instabilizar o funcionamento do seu PC.

Procure pelo recurso VT-X ou virtualization, geralmente esse recurso fica na guia Advanced ou Avançado:

Como posso habilitar a virtualização (VT) no meu PC? – Suporte ...
Deixe como – Enable ou Ativado-

Depois de ter ativado é só salvar as configurações e voltar a utilizar o Android Studio normalmente.

Sistemas operacionais obsoletos

Outro erro muito comum é a utilização de sistemas operacionais que já perderam suporte, como por exemplo o Windows 7.

Por estar obsoleto, o sistema deixa de receber bibliotecas importantes para o funcionamento de IDE’s modernas o que pode acarretar vários e vários erros sem nenhuma solução.

Por isso recomendo que utilize a versão mais recente do Windows 10.

Você pode baixar uma iso no site oficial clicando aqui.

Bibliotecas adicionais da Microsoft

E se mesmo utilizando um sistema operacional atualizado os erros persistirem, recomendo que baixe um pacote de bibliotecas adicionais da Microsoft que tem ajudado a solucionar a maioria dos problemas.

Clique aqui e baixe agora.

Infelizmente eu não consigo sanar todos os erros nesse artigo, mas caso você tenha algum erro específico deixe nos comentários abaixo para que eu vá acrescentando nesse artigo.

Um grande abraço !!

Sobre o Autor

Emerson Machado
Emerson Machado

Emerson Machado, especialista em Desenvolvimento de Aplicativos e em Tecnologia da Informação.

7 Comentários

Deixe um comentário

O seu endereço de e-mail não será publicado. Campos obrigatórios são marcados com *


  1. Olá eu consigo intalar o Androis Studio mas ao tentar sincronizar o projeto da esse erro:FAILURE: Build failed with an exception.

    * Where:
    Initialization script ‘C:\Users\lucas\AppData\Local\Temp\ijinit.gradle’ line: 4

    * What went wrong:
    Could not compile initialization script ‘C:\Users\lucas\AppData\Local\Temp\ijinit.gradle’.
    > startup failed:
    initialization script ‘C:\Users\lucas\AppData\Local\Temp\ijinit.gradle’: 4: unable to resolve class org.jetbrains.plugins.gradle.tooling.internal.ExtraModelBuilder
    @ line 4, column 1.
    import org.jetbrains.plugins.gradle.tooling.internal.ExtraModelBuilder
    ^

    1 error

    * Try:
    Run with –info or –debug option to get more log output. Run with –scan to get full insights.

    * Exception is:
    org.gradle.groovy.scripts.ScriptCompilationException: Could not compile initialization script ‘C:\Users\lucas\AppData\Local\Temp\ijinit.gradle’.
    at org.gradle.groovy.scripts.internal.DefaultScriptCompilationHandler.wrapCompilationFailure(DefaultScriptCompilationHandler.java:195)
    at org.gradle.groovy.scripts.internal.DefaultScriptCompilationHandler.compileScript(DefaultScriptCompilationHandler.java:143)
    at org.gradle.groovy.scripts.internal.DefaultScriptCompilationHandler.compileToDir(DefaultScriptCompilationHandler.java:97)
    at org.gradle.groovy.scripts.internal.BuildOperationBackedScriptCompilationHandler$2.run(BuildOperationBackedScriptCompilationHandler.java:54)
    at org.gradle.internal.operations.DefaultBuildOperationExecutor$RunnableBuildOperationWorker.execute(DefaultBuildOperationExecutor.java:395)
    at org.gradle.internal.operations.DefaultBuildOperationExecutor$RunnableBuildOperationWorker.execute(DefaultBuildOperationExecutor.java:387)
    at org.gradle.internal.operations.DefaultBuildOperationExecutor$1.execute(DefaultBuildOperationExecutor.java:157)
    at org.gradle.internal.operations.DefaultBuildOperationExecutor.execute(DefaultBuildOperationExecutor.java:242)
    at org.gradle.internal.operations.DefaultBuildOperationExecutor.execute(DefaultBuildOperationExecutor.java:150)
    at org.gradle.internal.operations.DefaultBuildOperationExecutor.run(DefaultBuildOperationExecutor.java:84)
    at org.gradle.internal.operations.DelegatingBuildOperationExecutor.run(DelegatingBuildOperationExecutor.java:31)
    at org.gradle.groovy.scripts.internal.BuildOperationBackedScriptCompilationHandler.compileToDir(BuildOperationBackedScriptCompilationHandler.java:51)
    at org.gradle.groovy.scripts.internal.FileCacheBackedScriptClassCompiler$CompileToCrossBuildCacheAction.execute(FileCacheBackedScriptClassCompiler.java:190)
    at org.gradle.groovy.scripts.internal.FileCacheBackedScriptClassCompiler$CompileToCrossBuildCacheAction.execute(FileCacheBackedScriptClassCompiler.java:170)
    at org.gradle.groovy.scripts.internal.FileCacheBackedScriptClassCompiler$ProgressReportingInitializer.execute(FileCacheBackedScriptClassCompiler.java:215)
    at org.gradle.groovy.scripts.internal.FileCacheBackedScriptClassCompiler$ProgressReportingInitializer.execute(FileCacheBackedScriptClassCompiler.java:194)
    at org.gradle.cache.internal.DefaultPersistentDirectoryCache$Initializer.initialize(DefaultPersistentDirectoryCache.java:100)
    at org.gradle.cache.internal.FixedSharedModeCrossProcessCacheAccess$1.run(FixedSharedModeCrossProcessCacheAccess.java:86)
    at org.gradle.cache.internal.DefaultFileLockManager$DefaultFileLock.doWriteAction(DefaultFileLockManager.java:215)
    at org.gradle.cache.internal.DefaultFileLockManager$DefaultFileLock.writeFile(DefaultFileLockManager.java:205)
    at org.gradle.cache.internal.FixedSharedModeCrossProcessCacheAccess.open(FixedSharedModeCrossProcessCacheAccess.java:83)
    at org.gradle.cache.internal.DefaultCacheAccess.open(DefaultCacheAccess.java:139)
    at org.gradle.cache.internal.DefaultPersistentDirectoryStore.open(DefaultPersistentDirectoryStore.java:78)
    at org.gradle.cache.internal.DefaultPersistentDirectoryStore.open(DefaultPersistentDirectoryStore.java:42)
    at org.gradle.cache.internal.DefaultCacheFactory.doOpen(DefaultCacheFactory.java:95)
    at org.gradle.cache.internal.DefaultCacheFactory.open(DefaultCacheFactory.java:68)
    at org.gradle.cache.internal.DefaultCacheRepository$PersistentCacheBuilder.open(DefaultCacheRepository.java:126)
    at org.gradle.groovy.scripts.internal.FileCacheBackedScriptClassCompiler.compile(FileCacheBackedScriptClassCompiler.java:111)
    at org.gradle.groovy.scripts.internal.CrossBuildInMemoryCachingScriptClassCache.getOrCompile(CrossBuildInMemoryCachingScriptClassCache.java:50)
    at org.gradle.groovy.scripts.internal.BuildScopeInMemoryCachingScriptClassCompiler.compile(BuildScopeInMemoryCachingScriptClassCompiler.java:50)
    at org.gradle.groovy.scripts.DefaultScriptCompilerFactory$ScriptCompilerImpl.compile(DefaultScriptCompilerFactory.java:49)
    at org.gradle.configuration.DefaultScriptPluginFactory$ScriptPluginImpl.apply(DefaultScriptPluginFactory.java:125)
    at org.gradle.configuration.BuildOperationScriptPlugin$1$1.run(BuildOperationScriptPlugin.java:69)
    at org.gradle.internal.operations.DefaultBuildOperationExecutor$RunnableBuildOperationWorker.execute(DefaultBuildOperationExecutor.java:395)
    at org.gradle.internal.operations.DefaultBuildOperationExecutor$RunnableBuildOperationWorker.execute(DefaultBuildOperationExecutor.java:387)
    at org.gradle.internal.operations.DefaultBuildOperationExecutor$1.execute(DefaultBuildOperationExecutor.java:157)
    at org.gradle.internal.operations.DefaultBuildOperationExecutor.execute(DefaultBuildOperationExecutor.java:242)
    at org.gradle.internal.operations.DefaultBuildOperationExecutor.execute(DefaultBuildOperationExecutor.java:150)
    at org.gradle.internal.operations.DefaultBuildOperationExecutor.run(DefaultBuildOperationExecutor.java:84)
    at org.gradle.internal.operations.DelegatingBuildOperationExecutor.run(DelegatingBuildOperationExecutor.java:31)
    at org.gradle.configuration.BuildOperationScriptPlugin$1.execute(BuildOperationScriptPlugin.java:66)
    at org.gradle.configuration.BuildOperationScriptPlugin$1.execute(BuildOperationScriptPlugin.java:63)
    at org.gradle.configuration.internal.DefaultUserCodeApplicationContext.apply(DefaultUserCodeApplicationContext.java:49)
    at org.gradle.configuration.BuildOperationScriptPlugin.apply(BuildOperationScriptPlugin.java:63)
    at org.gradle.configuration.DefaultInitScriptProcessor.process(DefaultInitScriptProcessor.java:50)
    at org.gradle.initialization.InitScriptHandler$1.run(InitScriptHandler.java:55)
    at org.gradle.internal.operations.DefaultBuildOperationExecutor$RunnableBuildOperationWorker.execute(DefaultBuildOperationExecutor.java:395)
    at org.gradle.internal.operations.DefaultBuildOperationExecutor$RunnableBuildOperationWorker.execute(DefaultBuildOperationExecutor.java:387)
    at org.gradle.internal.operations.DefaultBuildOperationExecutor$1.execute(DefaultBuildOperationExecutor.java:157)
    at org.gradle.internal.operations.DefaultBuildOperationExecutor.execute(DefaultBuildOperationExecutor.java:242)
    at org.gradle.internal.operations.DefaultBuildOperationExecutor.execute(DefaultBuildOperationExecutor.java:150)
    at org.gradle.internal.operations.DefaultBuildOperationExecutor.run(DefaultBuildOperationExecutor.java:84)
    at org.gradle.internal.operations.DelegatingBuildOperationExecutor.run(DelegatingBuildOperationExecutor.java:31)
    at org.gradle.initialization.InitScriptHandler.executeScripts(InitScriptHandler.java:49)
    at org.gradle.initialization.DefaultSettingsPreparer.prepareSettings(DefaultSettingsPreparer.java:33)
    at org.gradle.initialization.BuildOperatingFiringSettingsPreparer$LoadBuild.doLoadBuild(BuildOperatingFiringSettingsPreparer.java:59)
    at org.gradle.initialization.BuildOperatingFiringSettingsPreparer$LoadBuild.run(BuildOperatingFiringSettingsPreparer.java:54)
    at org.gradle.internal.operations.DefaultBuildOperationExecutor$RunnableBuildOperationWorker.execute(DefaultBuildOperationExecutor.java:395)
    at org.gradle.internal.operations.DefaultBuildOperationExecutor$RunnableBuildOperationWorker.execute(DefaultBuildOperationExecutor.java:387)
    at org.gradle.internal.operations.DefaultBuildOperationExecutor$1.execute(DefaultBuildOperationExecutor.java:157)
    at org.gradle.internal.operations.DefaultBuildOperationExecutor.execute(DefaultBuildOperationExecutor.java:242)
    at org.gradle.internal.operations.DefaultBuildOperationExecutor.execute(DefaultBuildOperationExecutor.java:150)
    at org.gradle.internal.operations.DefaultBuildOperationExecutor.run(DefaultBuildOperationExecutor.java:84)
    at org.gradle.internal.operations.DelegatingBuildOperationExecutor.run(DelegatingBuildOperationExecutor.java:31)
    at org.gradle.initialization.BuildOperatingFiringSettingsPreparer.prepareSettings(BuildOperatingFiringSettingsPreparer.java:42)
    at org.gradle.initialization.DefaultGradleLauncher.prepareSettings(DefaultGradleLauncher.java:210)
    at org.gradle.initialization.DefaultGradleLauncher.doClassicBuildStages(DefaultGradleLauncher.java:151)
    at org.gradle.initialization.DefaultGradleLauncher.doBuildStages(DefaultGradleLauncher.java:140)
    at org.gradle.initialization.DefaultGradleLauncher.executeTasks(DefaultGradleLauncher.java:120)
    at org.gradle.internal.invocation.GradleBuildController$1.create(GradleBuildController.java:74)
    at org.gradle.internal.invocation.GradleBuildController$1.create(GradleBuildController.java:67)
    at org.gradle.internal.work.DefaultWorkerLeaseService.withLocks(DefaultWorkerLeaseService.java:180)
    at org.gradle.internal.work.StopShieldingWorkerLeaseService.withLocks(StopShieldingWorkerLeaseService.java:40)
    at org.gradle.internal.invocation.GradleBuildController.doBuild(GradleBuildController.java:67)
    at org.gradle.internal.invocation.GradleBuildController.run(GradleBuildController.java:56)
    at org.gradle.tooling.internal.provider.runner.ClientProvidedPhasedActionRunner.run(ClientProvidedPhasedActionRunner.java:60)
    at org.gradle.launcher.exec.ChainingBuildActionRunner.run(ChainingBuildActionRunner.java:35)
    at org.gradle.launcher.exec.ChainingBuildActionRunner.run(ChainingBuildActionRunner.java:35)
    at org.gradle.launcher.exec.BuildOutcomeReportingBuildActionRunner.run(BuildOutcomeReportingBuildActionRunner.java:63)
    at org.gradle.tooling.internal.provider.ValidatingBuildActionRunner.run(ValidatingBuildActionRunner.java:32)
    at org.gradle.launcher.exec.BuildCompletionNotifyingBuildActionRunner.run(BuildCompletionNotifyingBuildActionRunner.java:39)
    at org.gradle.launcher.exec.RunAsBuildOperationBuildActionRunner$3.call(RunAsBuildOperationBuildActionRunner.java:51)
    at org.gradle.launcher.exec.RunAsBuildOperationBuildActionRunner$3.call(RunAsBuildOperationBuildActionRunner.java:45)
    at org.gradle.internal.operations.DefaultBuildOperationExecutor$CallableBuildOperationWorker.execute(DefaultBuildOperationExecutor.java:409)
    at org.gradle.internal.operations.DefaultBuildOperationExecutor$CallableBuildOperationWorker.execute(DefaultBuildOperationExecutor.java:399)
    at org.gradle.internal.operations.DefaultBuildOperationExecutor$1.execute(DefaultBuildOperationExecutor.java:157)
    at org.gradle.internal.operations.DefaultBuildOperationExecutor.execute(DefaultBuildOperationExecutor.java:242)
    at org.gradle.internal.operations.DefaultBuildOperationExecutor.execute(DefaultBuildOperationExecutor.java:150)
    at org.gradle.internal.operations.DefaultBuildOperationExecutor.call(DefaultBuildOperationExecutor.java:94)
    at org.gradle.internal.operations.DelegatingBuildOperationExecutor.call(DelegatingBuildOperationExecutor.java:36)
    at org.gradle.launcher.exec.RunAsBuildOperationBuildActionRunner.run(RunAsBuildOperationBuildActionRunner.java:45)
    at org.gradle.launcher.exec.InProcessBuildActionExecuter$1.transform(InProcessBuildActionExecuter.java:50)
    at org.gradle.launcher.exec.InProcessBuildActionExecuter$1.transform(InProcessBuildActionExecuter.java:47)
    at org.gradle.composite.internal.DefaultRootBuildState.run(DefaultRootBuildState.java:80)
    at org.gradle.launcher.exec.InProcessBuildActionExecuter.execute(InProcessBuildActionExecuter.java:47)
    at org.gradle.launcher.exec.InProcessBuildActionExecuter.execute(InProcessBuildActionExecuter.java:31)
    at org.gradle.launcher.exec.BuildTreeScopeBuildActionExecuter.execute(BuildTreeScopeBuildActionExecuter.java:42)
    at org.gradle.launcher.exec.BuildTreeScopeBuildActionExecuter.execute(BuildTreeScopeBuildActionExecuter.java:28)
    at org.gradle.tooling.internal.provider.ContinuousBuildActionExecuter.execute(ContinuousBuildActionExecuter.java:87)
    at org.gradle.tooling.internal.provider.ContinuousBuildActionExecuter.execute(ContinuousBuildActionExecuter.java:55)
    at org.gradle.tooling.internal.provider.SubscribableBuildActionExecuter.execute(SubscribableBuildActionExecuter.java:60)
    at org.gradle.tooling.internal.provider.SubscribableBuildActionExecuter.execute(SubscribableBuildActionExecuter.java:38)
    at org.gradle.tooling.internal.provider.SessionScopeBuildActionExecuter.execute(SessionScopeBuildActionExecuter.java:68)
    at org.gradle.tooling.internal.provider.SessionScopeBuildActionExecuter.execute(SessionScopeBuildActionExecuter.java:38)
    at org.gradle.tooling.internal.provider.GradleThreadBuildActionExecuter.execute(GradleThreadBuildActionExecuter.java:37)
    at org.gradle.tooling.internal.provider.GradleThreadBuildActionExecuter.execute(GradleThreadBuildActionExecuter.java:26)
    at org.gradle.tooling.internal.provider.StartParamsValidatingActionExecuter.execute(StartParamsValidatingActionExecuter.java:60)
    at org.gradle.tooling.internal.provider.StartParamsValidatingActionExecuter.execute(StartParamsValidatingActionExecuter.java:32)
    at org.gradle.tooling.internal.provider.SessionFailureReportingActionExecuter.execute(SessionFailureReportingActionExecuter.java:56)
    at org.gradle.tooling.internal.provider.SessionFailureReportingActionExecuter.execute(SessionFailureReportingActionExecuter.java:42)
    at org.gradle.tooling.internal.provider.SetupLoggingActionExecuter.execute(SetupLoggingActionExecuter.java:48)
    at org.gradle.tooling.internal.provider.SetupLoggingActionExecuter.execute(SetupLoggingActionExecuter.java:32)
    at org.gradle.launcher.daemon.server.exec.ExecuteBuild.doBuild(ExecuteBuild.java:68)
    at org.gradle.launcher.daemon.server.exec.BuildCommandOnly.execute(BuildCommandOnly.java:37)
    at org.gradle.launcher.daemon.server.api.DaemonCommandExecution.proceed(DaemonCommandExecution.java:104)
    at org.gradle.launcher.daemon.server.exec.WatchForDisconnection.execute(WatchForDisconnection.java:39)
    at org.gradle.launcher.daemon.server.api.DaemonCommandExecution.proceed(DaemonCommandExecution.java:104)
    at org.gradle.launcher.daemon.server.exec.ResetDeprecationLogger.execute(ResetDeprecationLogger.java:29)
    at org.gradle.launcher.daemon.server.api.DaemonCommandExecution.proceed(DaemonCommandExecution.java:104)
    at org.gradle.launcher.daemon.server.exec.RequestStopIfSingleUsedDaemon.execute(RequestStopIfSingleUsedDaemon.java:35)
    at org.gradle.launcher.daemon.server.api.DaemonCommandExecution.proceed(DaemonCommandExecution.java:104)
    at org.gradle.launcher.daemon.server.exec.ForwardClientInput$2.create(ForwardClientInput.java:78)
    at org.gradle.launcher.daemon.server.exec.ForwardClientInput$2.create(ForwardClientInput.java:75)
    at org.gradle.util.Swapper.swap(Swapper.java:38)
    at org.gradle.launcher.daemon.server.exec.ForwardClientInput.execute(ForwardClientInput.java:75)
    at org.gradle.launcher.daemon.server.api.DaemonCommandExecution.proceed(DaemonCommandExecution.java:104)
    at org.gradle.launcher.daemon.server.exec.LogAndCheckHealth.execute(LogAndCheckHealth.java:55)
    at org.gradle.launcher.daemon.server.api.DaemonCommandExecution.proceed(DaemonCommandExecution.java:104)
    at org.gradle.launcher.daemon.server.exec.LogToClient.doBuild(LogToClient.java:63)
    at org.gradle.launcher.daemon.server.exec.BuildCommandOnly.execute(BuildCommandOnly.java:37)
    at org.gradle.launcher.daemon.server.api.DaemonCommandExecution.proceed(DaemonCommandExecution.java:104)
    at org.gradle.launcher.daemon.server.exec.EstablishBuildEnvironment.doBuild(EstablishBuildEnvironment.java:82)
    at org.gradle.launcher.daemon.server.exec.BuildCommandOnly.execute(BuildCommandOnly.java:37)
    at org.gradle.launcher.daemon.server.api.DaemonCommandExecution.proceed(DaemonCommandExecution.java:104)
    at org.gradle.launcher.daemon.server.exec.StartBuildOrRespondWithBusy$1.run(StartBuildOrRespondWithBusy.java:52)
    at org.gradle.launcher.daemon.server.DaemonStateCoordinator$1.run(DaemonStateCoordinator.java:297)
    at org.gradle.internal.concurrent.ExecutorPolicy$CatchAndRecordFailures.onExecute(ExecutorPolicy.java:64)
    at org.gradle.internal.concurrent.ManagedExecutorImpl$1.run(ManagedExecutorImpl.java:48)
    at org.gradle.internal.concurrent.ThreadFactoryImpl$ManagedThreadRunnable.run(ThreadFactoryImpl.java:56)
    Caused by: org.codehaus.groovy.control.MultipleCompilationErrorsException: startup failed:
    initialization script ‘C:\Users\lucas\AppData\Local\Temp\ijinit.gradle’: 4: unable to resolve class org.jetbrains.plugins.gradle.tooling.internal.ExtraModelBuilder
    @ line 4, column 1.
    import org.jetbrains.plugins.gradle.tooling.internal.ExtraModelBuilder
    ^

    1 error

    at org.gradle.groovy.scripts.internal.DefaultScriptCompilationHandler.compileScript(DefaultScriptCompilationHandler.java:141)
    … 137 more

  2. boa noite preciso de uma ajuda na instalacao de meu android
    ele ta tentando fazer upload da platform sdk 29 e nao ta conseguindo ai da esse erro
    como devo resolver essa situacao?

    Unable to load class ‘org.gradle.api.internal.java.usagecontext.LazyConfigurationUsageContext’.

    This is an unexpected error. Please file a bug containing the idea.log file.

Este site utiliza Cookies e Tecnologias semelhantes para melhorar a sua experiência. Ao utilizar nosso site você concorda que está de acordo com a nossa Política de Privacidade.